Reaction Details
TargetKallikrein-7
LigandBDBM60517
Substrate/Competitorn/a
Meas. Tech.ChEBML_1663609
IC50>30000±n/a nM
Citation Lorthiois, EAnderson, KVulpetti, ARogel, OCumin, FOstermann, NSteinbacher, SMac Sweeney, ADelgado, OLiao, SMRandl, SRüdisser, SDussauge, SFettis, KKieffer, Lde Erkenez, AYang, LHartwieg, CArgikar, UALa Bonte, LRNewton, RKansara, VFlohr, SHommel, UJaffee, BMaibaum, J Discovery of Highly Potent and Selective Small-Molecule Reversible Factor D Inhibitors Demonstrating Alternative Complement Pathway Inhibition in Vivo. J Med Chem60:5717-5735 (2017) 
 
Kallikrein-7
Name:Kallikrein-7
Type:PROTEIN
Mol. Mass.:27535.05
Organism:Homo sapiens (Human)
Description:ChEMBL_1469257
Residue:253
BDBM60517
NameBDBM60517
Synonyms:US9085555, 124
Typen/a
Emp. Form.C22H20F3N5O4
Mol. Mass.475.4205
SMILESNC(=O)n1cc(NC(=O)N2CCC[C@H]2C(=O)Nc2cccc(OC(F)(F)F)c2)c2ccccc12