Reaction Details
TargetComplement factor D
LigandBDBM171350
Substrate/Competitorn/a
Meas. Tech.ChEMBL_1663630 (CHEMBL4013311)
IC50 11.0±n/a nM
Citation Lorthiois, EAnderson, KVulpetti, ARogel, OCumin, FOstermann, NSteinbacher, SMac Sweeney, ADelgado, OLiao, SMRandl, SRüdisser, SDussauge, SFettis, KKieffer, Lde Erkenez, AYang, LHartwieg, CArgikar, UALa Bonte, LRNewton, RKansara, VFlohr, SHommel, UJaffee, BMaibaum, J Discovery of Highly Potent and Selective Small-Molecule Reversible Factor D Inhibitors Demonstrating Alternative Complement Pathway Inhibition in Vivo. J Med Chem60:5717-5735 (2017) 
 
Complement factor D
Name:Complement factor D
Type:Protein
Mol. Mass.:27039.19
Organism:Homo sapiens (Human)
Description:P00746
Residue:253
BDBM171350
NameBDBM171350
Synonyms:1-(2-((1R,3S,5R)-3-((6-Bromopyridin-2-yl)carbamoyl)-2-azabicyclo[3.1.0]hexan-2-yl)-2-oxoethyl)-1H-indazole-3-carboxamide (7) | US9085555, 727
TypeSmall organic molecule
Emp. Form.C21H19BrN6O3
Mol. Mass.483.318
SMILESNC(=O)c1nn(CC(=O)N2[C@@H]3C[C@@H]3C[C@H]2C(=O)Nc2cccc(Br)n2)c2ccccc12