Reaction Details
TargetCytochrome P450 2C9
LigandBDBM170966
Substrate/Competitorn/a
Meas. Tech.ChEBML_1663631
IC50>10000±n/a nM
Citation Lorthiois, EAnderson, KVulpetti, ARogel, OCumin, FOstermann, NSteinbacher, SMac Sweeney, ADelgado, OLiao, SMRandl, SRüdisser, SDussauge, SFettis, KKieffer, Lde Erkenez, AYang, LHartwieg, CArgikar, UALa Bonte, LRNewton, RKansara, VFlohr, SHommel, UJaffee, BMaibaum, J Discovery of Highly Potent and Selective Small-Molecule Reversible Factor D Inhibitors Demonstrating Alternative Complement Pathway Inhibition in Vivo. J Med Chem60:5717-5735 (2017) 
 
Cytochrome P450 2C9
Name:Cytochrome P450 2C9
Type:Enzyme
Mol. Mass.:55636.33
Organism:Homo sapiens (Human)
Description:P11712
Residue:490
BDBM170966
NameBDBM170966
Synonyms:US9085555, 396
TypeSmall organic molecule
Emp. Form.C22H21F3N6O4
Mol. Mass.490.4351
SMILESN[C@H]1C[C@H](N(C1)C(=O)Nc1cn(C(N)=O)c2ccccc12)C(=O)Nc1cccc(OC(F)(F)F)c1