Reaction Details
TargetComplement factor D
LigandBDBM203865
Substrate/Competitorn/a
Meas. Tech.ChEMBL_1663644 (CHEMBL4013325)
IC50 14000±n/a nM
Citation Lorthiois, EAnderson, KVulpetti, ARogel, OCumin, FOstermann, NSteinbacher, SMac Sweeney, ADelgado, OLiao, SMRandl, SRüdisser, SDussauge, SFettis, KKieffer, Lde Erkenez, AYang, LHartwieg, CArgikar, UALa Bonte, LRNewton, RKansara, VFlohr, SHommel, UJaffee, BMaibaum, J Discovery of Highly Potent and Selective Small-Molecule Reversible Factor D Inhibitors Demonstrating Alternative Complement Pathway Inhibition in Vivo. J Med Chem60:5717-5735 (2017) 
 
Complement factor D
Name:Complement factor D
Type:Protein
Mol. Mass.:27039.19
Organism:Homo sapiens (Human)
Description:P00746
Residue:253
BDBM203865
NameBDBM203865
Synonyms:Methyl (S)-2-((2-((3-(trifluoromethoxy)phenyl)carbamoyl)pyrrolidine-1-carboxamido)-methyl)benzoate (2)
TypeSmall organic molecule
Emp. Form.C22H22F3N3O5
Mol. Mass.465.4224
SMILESCOC(=O)c1ccccc1CNC(=O)N1CCC[C@H]1C(=O)Nc1cccc(OC(F)(F)F)c1