Reaction Details
TargetComplement factor D
LigandBDBM50238248
Substrate/Competitorn/a
Meas. Tech.ChEMBL_1663630 (CHEMBL4013311)
IC50 250±n/a nM
Citation Lorthiois, EAnderson, KVulpetti, ARogel, OCumin, FOstermann, NSteinbacher, SMac Sweeney, ADelgado, OLiao, SMRandl, SRüdisser, SDussauge, SFettis, KKieffer, Lde Erkenez, AYang, LHartwieg, CArgikar, UALa Bonte, LRNewton, RKansara, VFlohr, SHommel, UJaffee, BMaibaum, J Discovery of Highly Potent and Selective Small-Molecule Reversible Factor D Inhibitors Demonstrating Alternative Complement Pathway Inhibition in Vivo. J Med Chem60:5717-5735 (2017) 
 
Complement factor D
Name:Complement factor D
Type:Protein
Mol. Mass.:27039.19
Organism:Homo sapiens (Human)
Description:P00746
Residue:253
BDBM50238248
NameBDBM50238248
Synonyms:CHEMBL4094108
TypeSmall organic molecule
Emp. Form.C23H19F4N5O4
Mol. Mass.505.4217
SMILES[H][C@]12C[C@@]1([H])N([C@@H](C2)C(=O)Nc1cccc(OC(F)(F)F)c1F)C(=O)Nc1cn(C(N)=O)c2ccccc12