Reaction Details
TargetD(2) dopamine receptor
LigandBDBM50443101
Substrate/Competitorn/a
Meas. Tech.ChEMBL_1662859 (CHEMBL4012540)
Ki 0.490000±n/a nM
Citation Flick, ACDing, HXLeverett, CAKyne, RELiu, KKFink, SJO'Donnell, CJ Synthetic Approaches to the New Drugs Approved During 2015. J Med Chem60:6480-6515 (2017) 
 
D(2) dopamine receptor
Name:D(2) dopamine receptor
Type:Cell-surface receptors
Mol. Mass.:50647.10
Organism:Homo sapiens (Human)
Description:P14416
Residue:443
BDBM50443101
NameBDBM50443101
Synonyms:Cariprazine | RGH-188
TypeSmall organic molecule
Emp. Form.C21H32Cl2N4O
Mol. Mass.427.411
SMILESCN(C)C(=O)N[C@H]1CC[C@H](CCN2CCN(CC2)c2cccc(Cl)c2Cl)CC1