Reaction Details
TargetMast/stem cell growth factor receptor Kit
LigandBDBM13530
Substrate/Competitorn/a
Meas. Tech.ChEMBL_1662941 (CHEMBL4012622)
IC50 41±n/a nM
Citation Lu, YMao, FLi, XZheng, XWang, MXu, QZhu, JLi, J Discovery of Potent, Selective Stem Cell Factor Receptor/Platelet Derived Growth Factor Receptor Alpha (c-KIT/PDGFRa) Dual Inhibitor for the Treatment of Imatinib-Resistant Gastrointestinal Stromal Tumors (GISTs). J Med Chem60:5099-5119 (2017) 
 
Mast/stem cell growth factor receptor Kit
Name:Mast/stem cell growth factor receptor Kit
Type:Protein
Mol. Mass.:109869.37
Organism:Homo sapiens (Human)
Description:P10721
Residue:976
BDBM13530
NameBDBM13530
Synonyms:4-[(4-methylpiperazin-1-yl)methyl]-N-[4-methyl-3-[(4-pyridin-3-ylpyrimidin-2-yl)amino]phenyl]benzamide Gleevec Imatinib, 21 STI-571 US10906896, Cpd imatinib US11725005, Compound imatinib cid_5291 med.21724, Compound 6
TypeSmall organic molecule
Emp. Form.C29H31N7O
Mol. Mass.493.6027
SMILESCN1CCN(Cc2ccc(cc2)C(=O)Nc2ccc(C)c(Nc3nccc(n3)-c3cccnc3)c2)CC1