Reaction Details
TargetMast/stem cell growth factor receptor Kit
LigandBDBM50238290
Substrate/Competitorn/a
Meas. Tech.ChEMBL_1662941 (CHEMBL4012622)
IC50 2.6±n/a nM
Citation Lu, YMao, FLi, XZheng, XWang, MXu, QZhu, JLi, J Discovery of Potent, Selective Stem Cell Factor Receptor/Platelet Derived Growth Factor Receptor Alpha (c-KIT/PDGFRa) Dual Inhibitor for the Treatment of Imatinib-Resistant Gastrointestinal Stromal Tumors (GISTs). J Med Chem60:5099-5119 (2017) 
 
Mast/stem cell growth factor receptor Kit
Name:Mast/stem cell growth factor receptor Kit
Type:Protein
Mol. Mass.:109869.37
Organism:Homo sapiens (Human)
Description:P10721
Residue:976
BDBM50238290
NameBDBM50238290
Synonyms:CHEMBL4064941
TypeSmall organic molecule
Emp. Form.C22H22N6O
Mol. Mass.386.4497
SMILESCN(C)c1cccc(NC(=O)Nc2ccc(cc2)-c2ccnc3[nH]nc(C)c23)c1