Reaction Details
TargetRAF proto-oncogene serine/threonine-protein kinase/Serine/threonine-protein kinase B-raf
LigandBDBM50396483
Substrate/Competitorn/a
Meas. Tech.ChEMBL_1663102 (CHEMBL4012783)
EC50 601±n/a nM
Citation Nishiguchi, GARico, ATanner, HAversa, RJTaft, BRSubramanian, SSetti, LBurger, MTWan, LTamez, VSmith, ALou, YBarsanti, PAAppleton, BAMamo, MTandeske, LDix, ITellew, JEHuang, SMathews Griner, LACooke, VGVan Abbema, AMerritt, HMa, SGampa, KFeng, FYuan, JWang, YHaling, JRVaziri, SHekmat-Nejad, MJansen, JMPolyakov, VZang, RSethuraman, VAmiri, PSingh, MLees, EShao, WStuart, DDDillon, MPRamurthy, S Design and Discovery of N-(2-Methyl-5'-morpholino-6'-((tetrahydro-2H-pyran-4-yl)oxy)-[3,3'-bipyridin]-5-yl)-3-(trifluoromethyl)benzamide (RAF709): A Potent, Selective, and Efficacious RAF Inhibitor Targeting RAS Mutant Cancers. J Med Chem60:4869-4881 (2017) 
 
RAF proto-oncogene serine/threonine-protein kinase/Serine/threonine-protein kinase B-raf
Name:RAF proto-oncogene serine/threonine-protein kinase/Serine/threonine-protein kinase B-raf
Synonyms:BRAF/CRAF
Type:n/a
Mol. Mass.:n/a
Description:ASSAY_ID of ChEMBL is 1663102
Components:This complex has 2 components.
Component 1
Name:RAF proto-oncogene serine/threonine-protein kinase
Type:Serine/threonine-protein kinase
Mol. Mass.:73082.52
Organism:Homo sapiens (Human)
Description:P04049
Residue:648
Component 2
Name:Serine/threonine-protein kinase B-raf
Synonyms:B-RAF B-Raf proto-oncogene serine/threonine-protein kinase BRAF1 RAFB1 v-Raf murine sarcoma viral oncogene homolog B1
Type:Serine/threonine-protein kinase
Mol. Mass.:84446.00
Organism:Homo sapiens (Human)
Description:P15056
Residue:766
BDBM50396483
NameBDBM50396483
Synonyms:PLX-4032 Ro 5185426 US11332479, Compound Vemurafenib US9388165, Reference, Vemurafenib (PLX-4032) VEMURAFENIB
TypeSmall organic molecule
Emp. Form.C23H18ClF2N3O3S
Mol. Mass.489.922
SMILESCCCS(=O)(=O)Nc1ccc(F)c(C(=O)c2c[nH]c3ncc(cc23)-c2ccc(Cl)cc2)c1F