Reaction Details
TargetAdenosine receptor A2a
LigandBDBM50238404
Substrate/Competitorn/a
Meas. Tech.ChEMBL_1663191 (CHEMBL4012872)
Ki 6.8±n/a nM
Citation Falsini, MSquarcialupi, LCatarzi, DVarano, FBetti, MDal Ben, DMarucci, GBuccioni, MVolpini, RDe Vita, TCavalli, AColotta, V The 1,2,4-Triazolo[4,3-a]pyrazin-3-one as a Versatile Scaffold for the Design of Potent Adenosine Human Receptor Antagonists. Structural Investigations to Target the A J Med Chem60:5772-5790 (2017) 
 
Adenosine receptor A2a
Name:Adenosine receptor A2a
Type:G Protein-Coupled Receptor (GPCR)
Mol. Mass.:44716.46
Organism:Homo sapiens (Human)
Description:P29274
Residue:412
BDBM50238404
NameBDBM50238404
Synonyms:CHEMBL4097391
TypeSmall organic molecule
Emp. Form.C18H15N5O2
Mol. Mass.333.344
SMILESCOc1cccc(c1)-c1cn2c(nn(-c3ccccc3)c2=O)c(N)n1