Reaction Details
TargetAdenosine receptor A3
LigandBDBM50238395
Substrate/Competitorn/a
Meas. Tech.ChEMBL_1663192 (CHEMBL4012873)
Ki 11±n/a nM
Citation Falsini, MSquarcialupi, LCatarzi, DVarano, FBetti, MDal Ben, DMarucci, GBuccioni, MVolpini, RDe Vita, TCavalli, AColotta, V The 1,2,4-Triazolo[4,3-a]pyrazin-3-one as a Versatile Scaffold for the Design of Potent Adenosine Human Receptor Antagonists. Structural Investigations to Target the A J Med Chem60:5772-5790 (2017) 
 
Adenosine receptor A3
Name:Adenosine receptor A3
Type:G Protein-Coupled Receptor (GPCR)
Mol. Mass.:36197.32
Organism:Homo sapiens (Human)
Description:P0DMS8
Residue:318
BDBM50238395
NameBDBM50238395
Synonyms:CHEMBL4080925
TypeSmall organic molecule
Emp. Form.C17H13N5O
Mol. Mass.303.318
SMILESNc1nc(cn2c1nn(-c1ccccc1)c2=O)-c1ccccc1