Reaction Details
TargetcGMP-inhibited 3',5'-cyclic phosphodiesterase 3A
LigandBDBM50238419
Substrate/Competitorn/a
Meas. Tech.ChEMBL_1663231 (CHEMBL4012912)
IC50 50119±n/a nM
Citation Thomson, DWWagner, AJBantscheff, MBenson, REDittus, LDuempelfeld, BDrewes, GKrause, JMoore, JTMueller, KPoeckel, DRau, CSalzer, EShewchuk, LHopf, CEmery, JGMuelbaier, M Discovery of a Highly Selective Tankyrase Inhibitor Displaying Growth Inhibition Effects against a Diverse Range of Tumor Derived Cell Lines. J Med Chem60:5455-5471 (2017) 
 
cGMP-inhibited 3',5'-cyclic phosphodiesterase 3A
Name:cGMP-inhibited 3',5'-cyclic phosphodiesterase 3A
Type:Enzyme
Mol. Mass.:124966.46
Organism:Homo sapiens (Human)
Description:Q14432
Residue:1141
BDBM50238419
NameBDBM50238419
Synonyms:CHEMBL4060134
TypeSmall organic molecule
Emp. Form.C24H22N10O2
Mol. Mass.482.4973
SMILESCn1cnc(c1)C(=O)N1CCN(CC1)C(=O)c1ccc(Nc2nc3ccccc3n3nnnc23)cc1