Reaction Details
TargetProtein mono-ADP-ribosyltransferase PARP4
LigandBDBM50238425
Substrate/Competitorn/a
Meas. Tech.ChEMBL_1663205 (CHEMBL4012886)
IC50<5012±n/a nM
Citation Thomson, DWWagner, AJBantscheff, MBenson, REDittus, LDuempelfeld, BDrewes, GKrause, JMoore, JTMueller, KPoeckel, DRau, CSalzer, EShewchuk, LHopf, CEmery, JGMuelbaier, M Discovery of a Highly Selective Tankyrase Inhibitor Displaying Growth Inhibition Effects against a Diverse Range of Tumor Derived Cell Lines. J Med Chem60:5455-5471 (2017) 
 
Protein mono-ADP-ribosyltransferase PARP4
Name:Protein mono-ADP-ribosyltransferase PARP4
Type:n/a
Mol. Mass.:192563.23
Organism:Homo sapiens (Human)
Description:Q9UKK3
Residue:1724
BDBM50238425
NameBDBM50238425
Synonyms:CHEMBL4064332
TypeSmall organic molecule
Emp. Form.C17H16N6
Mol. Mass.304.3491
SMILESCC(C)c1ccc(Nc2nc3ccccc3n3nnnc23)cc1