Reaction Details
TargetPoly [ADP-ribose] polymerase tankyrase-1
LigandBDBM75029
Substrate/Competitorn/a
Meas. Tech.ChEMBL_1663214 (CHEMBL4012895)
IC50 1995±n/a nM
Citation Thomson, DWWagner, AJBantscheff, MBenson, REDittus, LDuempelfeld, BDrewes, GKrause, JMoore, JTMueller, KPoeckel, DRau, CSalzer, EShewchuk, LHopf, CEmery, JGMuelbaier, M Discovery of a Highly Selective Tankyrase Inhibitor Displaying Growth Inhibition Effects against a Diverse Range of Tumor Derived Cell Lines. J Med Chem60:5455-5471 (2017) 
 
Poly [ADP-ribose] polymerase tankyrase-1
Name:Poly [ADP-ribose] polymerase tankyrase-1
Type:Enzyme
Mol. Mass.:142058.03
Organism:Homo sapiens (Human)
Description:O95271
Residue:1327
BDBM75029
NameBDBM75029
Synonyms:MLS000686692 N-phenyl-[1,2,3,4]tetrazolo[1,5-a]quinoxalin-4-amine SMR000339750 phenyl(tetrazolo[1,5-a]quinoxalin-4-yl)amine
TypeSmall organic molecule
Emp. Form.C14H10N6
Mol. Mass.262.2694
SMILESN(c1ccccc1)c1nc2ccccc2n2nnnc12