Reaction Details
TargetPoly [ADP-ribose] polymerase tankyrase-1
LigandBDBM50238440
Substrate/Competitorn/a
Meas. Tech.ChEMBL_1663214 (CHEMBL4012895)
IC50 1259±n/a nM
Citation Thomson, DWWagner, AJBantscheff, MBenson, REDittus, LDuempelfeld, BDrewes, GKrause, JMoore, JTMueller, KPoeckel, DRau, CSalzer, EShewchuk, LHopf, CEmery, JGMuelbaier, M Discovery of a Highly Selective Tankyrase Inhibitor Displaying Growth Inhibition Effects against a Diverse Range of Tumor Derived Cell Lines. J Med Chem60:5455-5471 (2017) 
 
Poly [ADP-ribose] polymerase tankyrase-1
Name:Poly [ADP-ribose] polymerase tankyrase-1
Type:Enzyme
Mol. Mass.:142058.03
Organism:Homo sapiens (Human)
Description:O95271
Residue:1327
BDBM50238440
NameBDBM50238440
Synonyms:CHEMBL1503900
TypeSmall organic molecule
Emp. Form.C15H12N6
Mol. Mass.276.296
SMILESCc1ccc(Nc2nc3ccccc3n3nnnc23)cc1