Reaction Details
TargetProto-oncogene tyrosine-protein kinase Src
LigandBDBM50238532
Substrate/Competitorn/a
Meas. Tech.ChEMBL_1663822 (CHEMBL4013503)
Ki>100000±n/a nM
Citation Vignaroli, GIovenitti, GZamperini, CConiglio, FCalandro, PMolinari, AFallacara, ALSartucci, ACalgani, AColecchia, DMancini, AFestuccia, CDreassi, EValoti, MMusumeci, FChiariello, MAngelucci, ABotta, MSchenone, S Prodrugs of Pyrazolo[3,4-d]pyrimidines: From Library Synthesis to Evaluation as Potential Anticancer Agents in an Orthotopic Glioblastoma Model. J Med Chem60:6305-6320 (2017) 
 
Proto-oncogene tyrosine-protein kinase Src
Name:Proto-oncogene tyrosine-protein kinase Src
Type:Protein
Mol. Mass.:59838.60
Organism:Homo sapiens (Human)
Description:P12931
Residue:536
BDBM50238532
NameBDBM50238532
Synonyms:CHEMBL4084427
TypeSmall organic molecule
Emp. Form.C30H36BrN7O2S
Mol. Mass.638.622
SMILESCSc1nc(N(C(=O)OC(C)CN2CCN(C)CC2)c2cccc(Br)c2)c2cnn(CC(C)c3ccccc3)c2n1