Reaction Details
TargetTyrosine-protein kinase ABL1
LigandBDBM50238533
Substrate/Competitorn/a
Meas. Tech.ChEMBL_1663821 (CHEMBL4013502)
Ki>100000±n/a nM
Citation Vignaroli, GIovenitti, GZamperini, CConiglio, FCalandro, PMolinari, AFallacara, ALSartucci, ACalgani, AColecchia, DMancini, AFestuccia, CDreassi, EValoti, MMusumeci, FChiariello, MAngelucci, ABotta, MSchenone, S Prodrugs of Pyrazolo[3,4-d]pyrimidines: From Library Synthesis to Evaluation as Potential Anticancer Agents in an Orthotopic Glioblastoma Model. J Med Chem60:6305-6320 (2017) 
 
Tyrosine-protein kinase ABL1
Name:Tyrosine-protein kinase ABL1
Type:Enzyme
Mol. Mass.:122897.30
Organism:Homo sapiens (Human)
Description:P00519
Residue:1130
BDBM50238533
NameBDBM50238533
Synonyms:CHEMBL4060917
TypeSmall organic molecule
Emp. Form.C36H40BrN7O2S
Mol. Mass.714.718
SMILESCSc1nc(N(C(=O)OC(CN2CCN(C)CC2)Cc2ccccc2)c2cccc(Br)c2)c2cnn(CC(C)c3ccccc3)c2n1