Reaction Details
TargetHistone-lysine N-methyltransferase SETD7
LigandBDBM50238541
Substrate/Competitorn/a
Meas. Tech.ChEBML_1663875
IC50>100000±n/a nM
Citation Mao, RShao, JZhu, KZhang, YDing, HZhang, CShi, ZJiang, HSun, DDuan, WLuo, C Potent, Selective, and Cell Active Protein Arginine Methyltransferase 5 (PRMT5) Inhibitor Developed by Structure-Based Virtual Screening and Hit Optimization. J Med Chem60:6289-6304 (2017) 
 
Histone-lysine N-methyltransferase SETD7
Name:Histone-lysine N-methyltransferase SETD7
Type:Enzyme
Mol. Mass.:40691.12
Organism:Homo sapiens (Human)
Description:Q8WTS6
Residue:366
BDBM50238541
NameBDBM50238541
Synonyms:CHEMBL4092336
TypeSmall organic molecule
Emp. Form.C18H17N3O4S
Mol. Mass.371.41
SMILESCOC(=O)c1ccccc1NC(=O)CSc1nc2cc(OC)ccc2[nH]1