Reaction Details
TargetMethylosome protein 50/Protein arginine N-methyltransferase 5
LigandBDBM50238541
Substrate/Competitorn/a
Meas. Tech.ChEBML_1663895
Kd 987±n/a nM
Citation Mao, RShao, JZhu, KZhang, YDing, HZhang, CShi, ZJiang, HSun, DDuan, WLuo, C Potent, Selective, and Cell Active Protein Arginine Methyltransferase 5 (PRMT5) Inhibitor Developed by Structure-Based Virtual Screening and Hit Optimization. J Med Chem60:6289-6304 (2017) 
 
Methylosome protein 50/Protein arginine N-methyltransferase 5
Name:Methylosome protein 50/Protein arginine N-methyltransferase 5
Type:Protein
Mol. Mass.:n/a
Description:n/a
Components:This complex has 2 components.
Component 1
Name:Protein arginine N-methyltransferase 5
Synonyms:72 kDa ICln-binding protein HRMT1L5 IBP72 Jak-binding protein 1 PRMT5/MEP50 complex Protein arginine methyltransferase 5 (PRMT5) SKB1 homolog Shk1 kinase-binding protein 1 homolog
Type:Enzyme
Mol. Mass.:72679.99
Organism:Homo sapiens (Human)
Description:O14744
Residue:637
Component 2
Name:Methylosome protein 50
Synonyms:Androgen receptor cofactor p44 MEP50 Nbla10071 WD45 p44/Mep50
Type:Enzyme
Mol. Mass.:36713.38
Organism:Homo sapiens (Human)
Description:Q9BQA1
Residue:342
BDBM50238541
NameBDBM50238541
Synonyms:CHEMBL4092336
TypeSmall organic molecule
Emp. Form.C18H17N3O4S
Mol. Mass.371.41
SMILESCOC(=O)c1ccccc1NC(=O)CSc1nc2cc(OC)ccc2[nH]1