Reaction Details
TargetAcetylcholine receptor subunit alpha/beta/delta/epsilon
LigandBDBM50238584
Substrate/Competitorn/a
Meas. Tech.ChEMBL_1663458 (CHEMBL4013139)
IC50>10000±n/a nM
Citation Wu, YZhangsun, DZhu, XKaas, QZhangsun, MHarvey, PJCraik, DJMcIntosh, JMLuo, S a-Conotoxin [S9A]TxID Potently Discriminates betweena3ß4 anda6/a3ß4 Nicotinic Acetylcholine Receptors. J Med Chem60:5826-5833 (2017) 
 
Acetylcholine receptor subunit alpha/beta/delta/epsilon
Name:Acetylcholine receptor subunit alpha/beta/delta/epsilon
Synonyms:Nicotinic acetylcholine receptor alpha1/beta1/epsilon/delta
Type:n/a
Mol. Mass.:n/a
Description:ASSAY_ID of ChEMBL is 1285309
Components:This complex has 4 components.
Component 1
Name:Acetylcholine receptor subunit alpha
Type:Enzyme Catalytic Domain
Mol. Mass.:51932.98
Organism:MOUSE
Description:n-AChR 0 MOUSE::P04756
Residue:457
Component 2
Name:Acetylcholine receptor subunit beta
Synonyms:ACHB_MOUSE Acrb | Chrnb1
Type:PROTEIN
Mol. Mass.:56919.84
Organism:Mus musculus
Description:EBI_11803
Residue:501
Component 3
Name:Acetylcholine receptor subunit epsilon
Synonyms:ACHE_MOUSE Chrne
Type:PROTEIN
Mol. Mass.:54899.98
Organism:Mus musculus
Description:ChEMBL_108120
Residue:493
Component 4
Name:Acetylcholine receptor subunit delta
Synonyms:ACHD_MOUSE Acrd | Chrnd
Type:PROTEIN
Mol. Mass.:59138.17
Organism:Mus musculus
Description:EBI_100149
Residue:520
BDBM50238584
NameBDBM50238584
Synonyms:CHEMBL4089797
TypeSmall organic molecule
Emp. Form.C59H94N18O17S5
Mol. Mass.1487.813
SMILESCC[C@H](C)[C@@H]1NC(=O)[C@@H]2CCCN2C(=O)[C@H](CO)NC(=O)[C@H](CCCSC)NC(=O)[C@H](C)NC(=O)[C@H](C)NC(=O)[C@@H]2CSSC[C@H](NC(=O)CN)C(=O)N[C@@H](CSSC[C@H](NC1=O)C(N)=O)C(=O)N[C@@H](CO)C(=O)N[C@@H](Cc1cnc[nH]1)C(=O)N1CCC[C@H]1C(=O)N[C@@H](C(C)C)C(=O)N2