Reaction Details
TargetNeuronal acetylcholine receptor subunit alpha-3/alpha-6/beta-4
LigandBDBM50238614
Substrate/Competitorn/a
Meas. Tech.ChEMBL_1663455 (CHEMBL4013136)
IC50>10000±n/a nM
Citation Wu, YZhangsun, DZhu, XKaas, QZhangsun, MHarvey, PJCraik, DJMcIntosh, JMLuo, S a-Conotoxin [S9A]TxID Potently Discriminates betweena3ß4 anda6/a3ß4 Nicotinic Acetylcholine Receptors. J Med Chem60:5826-5833 (2017) 
 
Neuronal acetylcholine receptor subunit alpha-3/alpha-6/beta-4
Name:Neuronal acetylcholine receptor subunit alpha-3/alpha-6/beta-4
Synonyms:Nicotinic acetylcholine receptor alpha6/alpha3/beta4
Type:n/a
Mol. Mass.:n/a
Description:ASSAY_ID of ChEMBL is 2103200
Components:This complex has 3 components.
Component 1
Name:Neuronal acetylcholine receptor subunit alpha-3
Type:Enzyme
Mol. Mass.:56995.52
Organism:Rattus norvegicus (Rat)
Description:P04757
Residue:499
Component 2
Name:Neuronal acetylcholine receptor subunit beta-4
Synonyms:ACHB4_RAT Chrnb4 Neuronal acetylcholine receptor non-alpha-2 chain | Neuronal acetylcholine receptor protein beta-4 subunit
Type:Enzyme
Mol. Mass.:55863.89
Organism:Rattus norvegicus (Rat)
Description:P12392
Residue:495
Component 3
Name:Neuronal acetylcholine receptor subunit alpha-6
Synonyms:ACHA6_RAT Chrna6 Neuronal acetylcholine receptor subunit alpha-6 | Neuronal acetylcholine receptor subunit alpha-6/beta-3
Type:PROTEIN
Mol. Mass.:56943.53
Organism:Rattus norvegicus
Description:ChEMBL_1454451
Residue:493
BDBM50238614
NameBDBM50238614
Synonyms:CHEMBL4089306
TypeSmall organic molecule
Emp. Form.C57H92N18O18S5
Mol. Mass.1477.775
SMILESCC[C@H](C)[C@@H]1NC(=O)[C@H](C)NC(=O)[C@H](CO)NC(=O)[C@H](CCCSC)NC(=O)[C@H](C)NC(=O)[C@H](CO)NC(=O)[C@@H]2CSSC[C@H](NC(=O)CN)C(=O)N[C@@H](CSSC[C@H](NC1=O)C(N)=O)C(=O)N[C@@H](CO)C(=O)N[C@@H](Cc1cnc[nH]1)C(=O)N1CCC[C@H]1C(=O)N[C@@H](C(C)C)C(=O)N2