Reaction Details
TargetNeuronal acetylcholine receptor subunit alpha-3/beta-4
LigandBDBM50238616
Substrate/Competitorn/a
Meas. Tech.ChEMBL_1663470 (CHEMBL4013151)
IC50 518±n/a nM
Citation Wu, YZhangsun, DZhu, XKaas, QZhangsun, MHarvey, PJCraik, DJMcIntosh, JMLuo, S a-Conotoxin [S9A]TxID Potently Discriminates betweena3ß4 anda6/a3ß4 Nicotinic Acetylcholine Receptors. J Med Chem60:5826-5833 (2017) 
 
Neuronal acetylcholine receptor subunit alpha-3/beta-4
Name:Neuronal acetylcholine receptor subunit alpha-3/beta-4
Type:Protein
Mol. Mass.:n/a
Description:n/a
Components:This complex has 2 components.
Component 1
Name:Neuronal acetylcholine receptor subunit alpha-3
Synonyms:ACHA3_RAT Chrna3
Type:Enzyme
Mol. Mass.:56995.52
Organism:Rattus norvegicus (Rat)
Description:P04757
Residue:499
Component 2
Name:Neuronal acetylcholine receptor subunit beta-4
Synonyms:ACHB4_RAT Chrnb4 Neuronal acetylcholine receptor non-alpha-2 chain | Neuronal acetylcholine receptor protein beta-4 subunit
Type:Enzyme
Mol. Mass.:55863.89
Organism:Rattus norvegicus (Rat)
Description:P12392
Residue:495
BDBM50238616
NameBDBM50238616
Synonyms:CHEMBL3104238
TypeSmall organic molecule
Emp. Form.C79H125N27O25S4
Mol. Mass.1981.264
SMILES[H][C@@]12CCCN1C(=O)[C@H](CC(N)=O)NC(=O)[C@H](Cc1cnc[nH]1)NC(=O)[C@@H](NC(=O)[C@@]([H])(NC(=O)[C@]1([H])CSSC[C@H](NC(=O)[C@@H]3CCCN3C(=O)[C@H](CC(O)=O)NC(=O)[C@@H](N)CCCNC(N)=N)C(=O)N[C@@]([H])(CSSC[C@H](NC(=O)[C@@]([H])(NC(=O)[C@H](CCC(N)=O)NC2=O)[C@@H](C)CC)C(N)=O)C(=O)N[C@@H](CO)C(=O)N[C@@H](CC(N)=O)C(=O)N2CCC[C@@]2([H])C(=O)N[C@@H](C(C)C)C(=O)N1)[C@@H](C)O)C(C)C