Reaction Details
TargetEstrogen receptor
LigandBDBM50238720
Substrate/Competitorn/a
Meas. Tech.ChEMBL_1664059 (CHEMBL4013740)
IC50 4.3±n/a nM
Citation Min, JGuillen, VSSharma, AZhao, YZiegler, YGong, PMayne, CGSrinivasan, SKim, SHCarlson, KENettles, KWKatzenellenbogen, BSKatzenellenbogen, JA Adamantyl Antiestrogens with Novel Side Chains Reveal a Spectrum of Activities in Suppressing Estrogen Receptor Mediated Activities in Breast Cancer Cells. J Med Chem60:6321-6336 (2017) 
 
Estrogen receptor
Name:Estrogen receptor
Type:Protein
Mol. Mass.:66230.44
Organism:Homo sapiens (Human)
Description:P03372
Residue:595
BDBM50238720
NameBDBM50238720
Synonyms:CHEMBL4102857
TypeSmall organic molecule
Emp. Form.C30H35NO3
Mol. Mass.457.6038
SMILESOCCCCNC(=O)\C=C\c1ccc(cc1)C(=C1C2CC3CC(C2)CC1C3)c1ccc(O)cc1