Reaction Details
TargetEstrogen receptor
LigandBDBM50238741
Substrate/Competitorn/a
Meas. Tech.ChEMBL_1664059 (CHEMBL4013740)
IC50 0.300000±n/a nM
Citation Min, JGuillen, VSSharma, AZhao, YZiegler, YGong, PMayne, CGSrinivasan, SKim, SHCarlson, KENettles, KWKatzenellenbogen, BSKatzenellenbogen, JA Adamantyl Antiestrogens with Novel Side Chains Reveal a Spectrum of Activities in Suppressing Estrogen Receptor Mediated Activities in Breast Cancer Cells. J Med Chem60:6321-6336 (2017) 
 
Estrogen receptor
Name:Estrogen receptor
Type:Protein
Mol. Mass.:66230.44
Organism:Homo sapiens (Human)
Description:P03372
Residue:595
BDBM50238741
NameBDBM50238741
Synonyms:CHEBI:31638 Fulvestrant ZD-9238
TypeSmall organic molecule
Emp. Form.C32H47F5O3S
Mol. Mass.606.771
SMILES[H][C@@]12CC[C@H](O)[C@@]1(C)CC[C@]1([H])c3ccc(O)cc3C[C@@H](CCCCCCCCC[S+]([O-])CCCC(F)(F)C(F)(F)F)[C@@]21[H]