Reaction Details
Target5-hydroxytryptamine receptor 2C
LigandBDBM10755
Substrate/Competitorn/a
Meas. Tech.ChEMBL_1664081 (CHEMBL4013762)
EC50 15±n/a nM
Citation Zhang, GCheng, JMcCorvy, JDLorello, PJCaldarone, BJRoth, BLKozikowski, AP Discovery of N-Substituted (2-Phenylcyclopropyl)methylamines as Functionally Selective Serotonin 2C Receptor Agonists for Potential Use as Antipsychotic Medications. J Med Chem60:6273-6288 (2017) 
 
5-hydroxytryptamine receptor 2C
Name:5-hydroxytryptamine receptor 2C
Type:G Protein-Coupled Receptor (GPCR)
Mol. Mass.:51836.79
Organism:Homo sapiens (Human)
Description:P28335
Residue:458
BDBM10755
NameBDBM10755
Synonyms:14C-5-hydroxy tryptamine creatinine disulfate 5-HT 5-hydroxy tryptamine creatinine disulfate Serotonin | [3H]-5-HT
TypeSmall organic molecule
Emp. Form.C10H12N2O
Mol. Mass.176.2151
SMILESNCCc1c[nH]c2ccc(O)cc12