Reaction Details
TargetFibroblast growth factor receptor 4
LigandBDBM286984
Substrate/Competitorn/a
Meas. Tech.ChEMBL_1664216 (CHEMBL4013897)
Ki 73±n/a nM
Citation Brameld, KAOwens, TDVerner, EVenetsanakos, EBradshaw, JMPhan, VTTam, DLeung, KShu, JLaStant, JLoughhead, DGTon, TKarr, DEGerritsen, MEGoldstein, DMFunk, JO Discovery of the Irreversible Covalent FGFR Inhibitor 8-(3-(4-Acryloylpiperazin-1-yl)propyl)-6-(2,6-dichloro-3,5-dimethoxyphenyl)-2-(methylamino)pyrido[2,3-d]pyrimidin-7(8H)-one (PRN1371) for the Treatment of Solid Tumors. J Med Chem60:6516-6527 (2017) 
 
Fibroblast growth factor receptor 4
Name:Fibroblast growth factor receptor 4
Type:Protein
Mol. Mass.:87957.45
Organism:Homo sapiens (Human)
Description:P22455
Residue:802
BDBM286984
NameBDBM286984
Synonyms:8-(3-(4-acryloylpiperazin-1-yl)propyl)-6-(2,6-dichloro-3,5-dimethoxyphenyl)-2-(methylamino)pyrido[2,3-d]pyrimidin-7(8H)-one US11078199, Cpd 6 US9815834, Compound 6
TypeSmall organic molecule
Emp. Form.C26H30Cl2N6O4
Mol. Mass.561.46
SMILESCNc1ncc2cc(-c3c(Cl)c(OC)cc(OC)c3Cl)c(=O)n(CCCN3CCN(CC3)C(=O)C=C)c2n1