Reaction Details
TargetDual specificity protein kinase CLK1
LigandBDBM50238881
Substrate/Competitorn/a
Meas. Tech.ChEMBL_1664430 (CHEMBL4014111)
IC50 24±n/a nM
Citation Sun, QZSun, QZLin, GFLin, GFLi, LLLi, LLJin, XTJin, XTHuang, LYHuang, LYZhang, GZhang, GYang, WYang, WChen, KChen, KXiang, RXiang, RChen, CChen, CWei, YQWei, YQLu, GWLu, GWYang, SYYang, SY Discovery of Potent and Selective Inhibitors of Cdc2-Like Kinase 1 (CLK1) as a New Class of Autophagy Inducers. J Med Chem60:6337-6352 (2017) 
 
Dual specificity protein kinase CLK1
Name:Dual specificity protein kinase CLK1
Type:Protein
Mol. Mass.:57322.21
Organism:Homo sapiens (Human)
Description:P49759
Residue:484
BDBM50238881
NameBDBM50238881
Synonyms:CHEMBL4067143
TypeSmall organic molecule
Emp. Form.C23H19N5
Mol. Mass.365.4305
SMILESC[C@H](c1ccccc1)n1nnc2cnc3ccc(cc3c12)-c1ccnc(C)c1