Reaction Details
TargetN-formyl peptide receptor 2
LigandBDBM50098189
Substrate/Competitorn/a
Meas. Tech.ChEMBL_1664524 (CHEMBL4014205)
IC50 41±n/a nM
Citation Skovbakke, SLSkovbakke, SLSkovbakke, SLHoldfeldt, AHoldfeldt, AHoldfeldt, ANielsen, CNielsen, CNielsen, CHansen, AMHansen, AMHansen, AMPerez-Gassol, IPerez-Gassol, IPerez-Gassol, IDahlgren, CDahlgren, CDahlgren, CForsman, HForsman, HForsman, HFranzyk, HFranzyk, HFranzyk, H Combining Elements from Two Antagonists of Formyl Peptide Receptor 2 Generates More Potent Peptidomimetic Antagonists. J Med Chem60:6991-6997 (2017) 
 
N-formyl peptide receptor 2
Name:N-formyl peptide receptor 2
Type:G Protein-Coupled Receptor (GPCR)
Mol. Mass.:38968.35
Organism:Homo sapiens (Human)
Description:P25090
Residue:351
BDBM50098189
NameBDBM50098189
Synonyms:CHEMBL3588930
TypeSmall organic molecule
Emp. Form.C118H183N19O13
Mol. Mass.2075.8351
(=O)N[C@@H](CCCCN)C(=O)N(CCC(=O)N[C@@H](CCCCN)C(=O)N(CCC(=O)N[C@@H](CCCCN)C(=O)N(CCC(=O)N[C@@H](CCCCN)C(=O)N(CCC(=O)N[C@@H](CCCCN)C(=O)N(CCC(=O)N[C@@H](CCCCN)C(=O)N(CCC(N)=O)[C@@H](C)c1ccccc1)[C@@H](C)c1ccccc1)[C@@H](C)c1ccccc1)[C@@H](C)c1ccccc1)[C@@H](C)c1ccccc1)[C@@H](C)c1ccccc1