Reaction Details
TargetN-formyl peptide receptor 2
LigandBDBM50238906
Substrate/Competitorn/a
Meas. Tech.ChEMBL_1664517 (CHEMBL4014198)
IC50 15±n/a nM
Citation Skovbakke, SLSkovbakke, SLSkovbakke, SLHoldfeldt, AHoldfeldt, AHoldfeldt, ANielsen, CNielsen, CNielsen, CHansen, AMHansen, AMHansen, AMPerez-Gassol, IPerez-Gassol, IPerez-Gassol, IDahlgren, CDahlgren, CDahlgren, CForsman, HForsman, HForsman, HFranzyk, HFranzyk, HFranzyk, H Combining Elements from Two Antagonists of Formyl Peptide Receptor 2 Generates More Potent Peptidomimetic Antagonists. J Med Chem60:6991-6997 (2017) 
 
N-formyl peptide receptor 2
Name:N-formyl peptide receptor 2
Type:G Protein-Coupled Receptor (GPCR)
Mol. Mass.:38968.35
Organism:Homo sapiens (Human)
Description:P25090
Residue:351
BDBM50238906
NameBDBM50238906
Synonyms:CHEMBL4081147
TypeSmall organic molecule
Emp. Form.C124H170N21O14
Mol. Mass.2178.8084
SMILESCCN(CC)c1ccc2c(-c3ccccc3C(=O)N[C@@H](CCCCN)C(=O)N(CCC(=O)N[C@@H](CCCCN)C(=O)N(CCC(=O)N[C@@H](CCCCN)C(=O)N(CCC(=O)N[C@@H](CCCCN)C(=O)N(CCC(=O)N[C@@H](CCCCN)C(=O)N(CCC(=O)N[C@@H](CCCCN)C(=O)N(CCC(N)=O)Cc3ccccc3)Cc3ccccc3)Cc3ccccc3)Cc3ccccc3)Cc3ccccc3)Cc3ccccc3)c3ccc(cc3oc2c1)=[N+](CC)CC