Reaction Details
TargetDeath-associated protein kinase 2
LigandBDBM50024284
Substrate/Competitorn/a
Meas. Tech.ChEMBL_1664713 (CHEMBL4014509)
IC50 55000±n/a nM
Citation Wang, SXu, LLu, YTLiu, YFHan, BLiu, TTang, JLi, JWu, JLi, JYYu, LFYang, F Discovery of benzofuran-3(2H)-one derivatives as novel DRAK2 inhibitors that protect islet?-cells from apoptosis. Eur J Med Chem130:195-208 (2017) 
 
Death-associated protein kinase 2
Name:Death-associated protein kinase 2
Type:PROTEIN
Mol. Mass.:42900.09
Organism:Homo sapiens (Human)
Description:ChEMBL_774557
Residue:370
BDBM50024284
NameBDBM50024284
Synonyms:CHEMBL3334979
TypeSmall organic molecule
Emp. Form.C22H24N2O3S
Mol. Mass.396.503
SMILESCOc1ccc(cc1OC)-c1cnc2scc(NC(=O)C3CCCCC3)c2c1