Reaction Details
TargetDeath-associated protein kinase 2
LigandBDBM50580
Substrate/Competitorn/a
Meas. Tech.ChEMBL_1664713 (CHEMBL4014509)
IC50 3070±n/a nM
Citation Wang, SXu, LLu, YTLiu, YFHan, BLiu, TTang, JLi, JWu, JLi, JYYu, LFYang, F Discovery of benzofuran-3(2H)-one derivatives as novel DRAK2 inhibitors that protect islet?-cells from apoptosis. Eur J Med Chem130:195-208 (2017) 
 
Death-associated protein kinase 2
Name:Death-associated protein kinase 2
Type:PROTEIN
Mol. Mass.:42900.09
Organism:Homo sapiens (Human)
Description:ChEMBL_774557
Residue:370
BDBM50580
NameBDBM50580
Synonyms:(2Z)-2-(3,4-dihydroxybenzylidene)-6-hydroxy-coumaran-3-one (2Z)-2-[(3,4-dihydroxyphenyl)methylidene]-6-hydroxy-3-benzofuranone MLS000863576 SULFURETIN | cid_5281295
TypeSmall organic molecule
Emp. Form.C15H10O5
Mol. Mass.270.2369
SMILESOc1ccc2C(=O)\C(Oc2c1)=C\c1ccc(O)c(O)c1