Reaction Details
TargetNuclear receptor subfamily 1 group I member 2
LigandBDBM50009073
Substrate/Competitorn/a
Meas. Tech.ChEMBL_1664822 (CHEMBL4014618)
EC50 30600±n/a nM
Citation Proschak, EHeitel, PKalinowsky, LMerk, D Opportunities and Challenges for Fatty Acid Mimetics in Drug Discovery. J Med Chem60:5235-5266 (2017) 
 
Nuclear receptor subfamily 1 group I member 2
Name:Nuclear receptor subfamily 1 group I member 2
Type:Nuclear receptor
Mol. Mass.:49774.77
Organism:Homo sapiens (Human)
Description:O75469
Residue:434
BDBM50009073
NameBDBM50009073
Synonyms:4-(5-cyclopentyloxycarbonylamino-1-methyl-1H-indol-3-ylmethyl)-3-methoxy-N-o-tolylsulfonylbenzamide ZAFIRLUKAST cyclopentyl 3-[2-methoxy-4-(2-methylphenylsulfonylcarbamoyl)benzyl]-1-methyl-1H-indol-5-ylcarbamate
TypeSmall organic molecule
Emp. Form.C31H33N3O6S
Mol. Mass.575.675
SMILESCOc1cc(ccc1Cc1cn(C)c2ccc(NC(=O)OC3CCCC3)cc12)C(=O)NS(=O)(=O)c1ccccc1C