Reaction Details
TargetHistone deacetylase 3/Nuclear receptor corepressor 2 (HDAC3/NCoR2)
LigandBDBM50328678
Substrate/Competitorn/a
Meas. Tech.ChEMBL_1664928 (CHEMBL4014724)
IC50 6.8±n/a nM
Citation Ballante, FReddy, DRZhou, NJMarshall, GR Structural insights of SmKDAC8 inhibitors: Targeting Schistosoma epigenetics through a combined structure-based 3D QSAR, in vitro and synthesis strategy. Bioorg Med Chem25:2105-2132 (2017) 
 
Histone deacetylase 3/Nuclear receptor corepressor 2 (HDAC3/NCoR2)
Name:Histone deacetylase 3/Nuclear receptor corepressor 2 (HDAC3/NCoR2)
Type:n/a
Mol. Mass.:n/a
Description:ASSAY_ID of ChEMBL is 2146499
Components:This complex has 2 components.
Component 1
Name:Histone deacetylase 3
Synonyms:HD3 HDAC3_HUMAN Human HDAC3 SMAP45
Type:Enzyme
Mol. Mass.:48829.55
Organism:Homo sapiens (Human)
Description:O15379
Residue:428
Component 2
Name:Nuclear receptor corepressor 2
Synonyms:CTG repeat protein 26 Histone deacetylase 2/Nuclear receptor corepressor 2 NCOR2 Nuclear receptor corepressor 2 SMAP270 Silencing mediator of retinoic acid and thyroid hormone receptor TRAC | Thyroid-, retinoic-acid-receptor-associated corepressor
Type:Enzyme
Mol. Mass.:274839.59
Organism:Homo sapiens (Human)
Description:Q9Y618
Residue:2514
BDBM50328678
NameBDBM50328678
Synonyms:6-(1,3-Dioxo-1H,3H-benzo[de]isoquinolin-2-yl)-hexanoic acid hydroxyamide CHEMBL96051 Scriptaid | Scriptaid, 9
TypeSmall organic molecule
Emp. Form.C18H18N2O4
Mol. Mass.326.3465
SMILESONC(=O)CCCCCN1C(=O)c2cccc3cccc(C1=O)c23