Reaction Details
TargetHexokinase-4
LigandBDBM50239044
Substrate/Competitorn/a
Meas. Tech.ChEMBL_1664962 (CHEMBL4014758)
EC50 7.8±n/a nM
Citation Xu, JLin, SMyers, RWAddona, GBerger, JPCampbell, BChen, HSChen, ZEiermann, GJElowe, NHFarrer, BTFeng, WFu, QKats-Kagan, RKavana, MMalkani, SMcMasters, DRMitra, KPachanski, MJTong, XTrujillo, MEXu, LZhang, BZhang, FZhang, RParmee, ER Novel, highly potent systemic glucokinase activators for the treatment of Type 2 Diabetes Mellitus. Bioorg Med Chem Lett27:2069-2073 (2017) 
 
Hexokinase-4
Name:Hexokinase-4
Type:PROTEIN
Mol. Mass.:52101.81
Organism:Rattus norvegicus
Description:ChEMBL_1279785
Residue:465
BDBM50239044
NameBDBM50239044
Synonyms:CHEMBL4104680
TypeSmall organic molecule
Emp. Form.C26H24N4O6S
Mol. Mass.520.557
SMILESCOC(=O)c1ccc(nc1)-c1cc2cc(Oc3ccc(nc3)S(C)(=O)=O)c(cc2[nH]1)C1CCC(=O)N1C