Reaction Details
TargetHexokinase-4
LigandBDBM50239045
Substrate/Competitorn/a
Meas. Tech.ChEMBL_1664963 (CHEMBL4014759)
EC50 2.7±n/a nM
Citation Xu, JLin, SMyers, RWAddona, GBerger, JPCampbell, BChen, HSChen, ZEiermann, GJElowe, NHFarrer, BTFeng, WFu, QKats-Kagan, RKavana, MMalkani, SMcMasters, DRMitra, KPachanski, MJTong, XTrujillo, MEXu, LZhang, BZhang, FZhang, RParmee, ER Novel, highly potent systemic glucokinase activators for the treatment of Type 2 Diabetes Mellitus. Bioorg Med Chem Lett27:2069-2073 (2017) 
 
Hexokinase-4
Name:Hexokinase-4
Type:PROTEIN
Mol. Mass.:52101.81
Organism:Rattus norvegicus
Description:ChEMBL_1279785
Residue:465
BDBM50239045
NameBDBM50239045
Synonyms:CHEMBL4083339
TypeSmall organic molecule
Emp. Form.C25H21F3N4O4S
Mol. Mass.530.519
SMILESCN1C(CCC1=O)c1cc2[nH]c(cc2cc1Oc1ccc(nc1)S(C)(=O)=O)-c1ccc(cn1)C(F)(F)F