Reaction Details
Target5-hydroxytryptamine receptor 5A
LigandBDBM50024206
Substrate/Competitorn/a
Ki 1000±n/a nM
CommentsPDSP_437
Citation Matthes, HBoschert, UAmlaiky, NGrailhe, RPlassat, JLMuscatelli, FMattei, MGHen, R Mouse 5-hydroxytryptamine5A and 5-hydroxytryptamine5B receptors define a new family of serotonin receptors: cloning, functional expression, and chromosomal localization. Mol Pharmacol43:313-9 (1993) 5-hydroxytryptamine receptor 5A
Name:5-hydroxytryptamine receptor 5A
Type:Enzyme Catalytic Domain
Mol. Mass.:40749.33
Organism:MOUSE
Description:5-HT5 0 MOUSE::P30966
Residue:357
BDBM50024206
NameBDBM50024206
Synonyms:3-[2-(dimethylamino)ethyl]-1H-indol-5-ol 3-[2-(dimethylamino)ethyl]indol-5-ol 5-hydroxy-N,N-dimethyltryptamine Bufotenine DM5-HT N,N-dimethylserotonin
TypeSmall organic molecule
Emp. Form.C12H16N2O
Mol. Mass.204.2682
SMILESCN(C)CCc1c[nH]c2ccc(O)cc12