Reaction Details
Target5-hydroxytryptamine receptor 5A
LigandBDBM50007406
Substrate/Competitorn/a
Ki 2511.88±n/a nM
CommentsPDSP_1808
Citation Matthes, HBoschert, UAmlaiky, NGrailhe, RPlassat, JLMuscatelli, FMattei, MGHen, R Mouse 5-hydroxytryptamine5A and 5-hydroxytryptamine5B receptors define a new family of serotonin receptors: cloning, functional expression, and chromosomal localization. Mol Pharmacol43:313-9 (1993) 5-hydroxytryptamine receptor 5A
Name:5-hydroxytryptamine receptor 5A
Type:Enzyme Catalytic Domain
Mol. Mass.:40749.33
Organism:MOUSE
Description:5-HT5 0 MOUSE::P30966
Residue:357
BDBM50007406
NameBDBM50007406
Synonyms:1-(3-(trifluoromethyl)phenyl)piperazine 1-(3-Trifluoromethyl-phenyl)-piperazine(TFMPP) TFMPP
TypeSmall organic molecule
Emp. Form.C11H13F3N2
Mol. Mass.230.2295
SMILESFC(F)(F)c1cccc(c1)N1CCNCC1