Reaction Details
Target5-hydroxytryptamine receptor 5B
LigandBDBM21392
Substrate/Competitorn/a
Ki 39.81±n/a nM
CommentsPDSP_140
Citation Matthes, HBoschert, UAmlaiky, NGrailhe, RPlassat, JLMuscatelli, FMattei, MGHen, R Mouse 5-hydroxytryptamine5A and 5-hydroxytryptamine5B receptors define a new family of serotonin receptors: cloning, functional expression, and chromosomal localization. Mol Pharmacol43:313-9 (1993) 5-hydroxytryptamine receptor 5B
Name:5-hydroxytryptamine receptor 5B
Type:Enzyme Catalytic Domain
Mol. Mass.:41221.13
Organism:MOUSE
Description:5-HT5B 0 MOUSE::P31387
Residue:370
BDBM21392
NameBDBM21392
Synonyms:3-(2-aminoethyl)-1H-indole-5-carboxamide 5-CT,DP CHEMBL1256863 [3H]-5-CT [3H]-5-Carboxyamidotryptamine | [3H]-5-carboxamidotryptamine
TypeSmall organic molecule
Emp. Form.C11H13N3O
Mol. Mass.203.2404
SMILESNCCc1c[nH]c2ccc(cc12)C(N)=O