Reaction Details
Target5-hydroxytryptamine receptor 5B
LigandBDBM81498
Substrate/Competitorn/a
Ki 398.1±n/a nM
CommentsPDSP_1643
Citation Matthes, HBoschert, UAmlaiky, NGrailhe, RPlassat, JLMuscatelli, FMattei, MGHen, R Mouse 5-hydroxytryptamine5A and 5-hydroxytryptamine5B receptors define a new family of serotonin receptors: cloning, functional expression, and chromosomal localization. Mol Pharmacol43:313-9 (1993) 5-hydroxytryptamine receptor 5B
Name:5-hydroxytryptamine receptor 5B
Type:Enzyme Catalytic Domain
Mol. Mass.:41221.13
Organism:MOUSE
Description:5-HT5B 0 MOUSE::P31387
Residue:370
BDBM81498
NameBDBM81498
Synonyms:5-Methoxy-3-(1,2,3,6-tetrahydro-pyridin-4-yl)-1H-indole(RU-24969) CHEMBL18785 RU 24969
TypeSmall organic molecule
Emp. Form.C14H16N2O
Mol. Mass.228.2896
SMILESCOc1ccc2[nH]cc(C3=CCNCC3)c2c1