Reaction Details
TargetCasein kinase I isoform epsilon
LigandBDBM274432
Substrate/Competitorn/a
Meas. Tech.Kinase Assay
pH7.4±n/a
Temperature298.15±n/a K
IC50 0.943±n/a nM
Commentsextracted
Citation Velaparthi, UDarne, CPDodd, DSSampognaro, AJWittman, MDKumaravel, SMullick, DLiu, PRachamreddy, CR Substituted imidazoles as casein kinase 1 D/E inhibitors US Patent US9556179 Publication Date 1/31/2017
 
Casein kinase I isoform epsilon
Name:Casein kinase I isoform epsilon
Type:Protein
Mol. Mass.:47340.25
Organism:Homo sapiens (Human)
Description:P49674
Residue:416
BDBM274432
NameBDBM274432
Synonyms:N-(6-(4-(4-fluorophenyl)-1-(piperidin-4-yl)-1H-imidazol-5-yl)imidazo[1,2-b]pyridazin-2-yl)isonicotinamide | US9556179, Compound 1
TypeSmall organic molecule
Emp. Form.C26H23FN8O
Mol. Mass.482.5122
SMILESFc1ccc(cc1)-c1ncn(C2CCNCC2)c1-c1ccc2nc(NC(=O)c3ccncc3)cn2n1