Reaction Details
TargetCasein kinase I isoform epsilon
LigandBDBM274449
Substrate/Competitorn/a
Meas. Tech.Kinase Assay
pH7.4±n/a
Temperature298.15±n/a K
IC50 0.599±n/a nM
Commentsextracted
Citation Velaparthi, UDarne, CPDodd, DSSampognaro, AJWittman, MDKumaravel, SMullick, DLiu, PRachamreddy, CR Substituted imidazoles as casein kinase 1 D/E inhibitors US Patent US9556179 Publication Date 1/31/2017
 
Casein kinase I isoform epsilon
Name:Casein kinase I isoform epsilon
Type:Protein
Mol. Mass.:47340.25
Organism:Homo sapiens (Human)
Description:P49674
Residue:416
BDBM274449
NameBDBM274449
Synonyms:N-(6-(1-(1-((1H-imidazol-2- yl)methyl)piperidin-4-yl)-4-(4- fluorophenyl)-1H-imidazol-5- yl)imidazo[1,2-b]pyridazin-2-yl)-2- fluoroisonicotinamide | US9556179, Compound 18
TypeSmall organic molecule
Emp. Form.C30H26F2N10O
Mol. Mass.580.5906
SMILESFc1ccc(cc1)-c1ncn(C2CCN(Cc3ncc[nH]3)CC2)c1-c1ccc2nc(NC(=O)c3ccnc(F)c3)cn2n1