Reaction Details
TargetCasein kinase I isoform delta
LigandBDBM274472
Substrate/Competitorn/a
Meas. Tech.Kinase Assay
pH7.4±n/a
Temperature298.15±n/a K
IC50 0.128±n/a nM
Commentsextracted
Citation Velaparthi, UDarne, CPDodd, DSSampognaro, AJWittman, MDKumaravel, SMullick, DLiu, PRachamreddy, CR Substituted imidazoles as casein kinase 1 D/E inhibitors US Patent US9556179 Publication Date 1/31/2017
 
Casein kinase I isoform delta
Name:Casein kinase I isoform delta
Type:Enzyme
Mol. Mass.:47356.76
Organism:Homo sapiens (Human)
Description:P48730
Residue:415
BDBM274472
NameBDBM274472
Synonyms:2-fluoro-N-(6-(4-(4-fluorophenyl)-1-(1- (2-hydroxyacetyl)piperidin-4-yl)-1H- imidazol-5-yl)imidazo[1,2-6]pyridazin- 2-yl)isonicotinamide | US9556179, Compound 41
TypeSmall organic molecule
Emp. Form.C28H24F2N8O3
Mol. Mass.558.5388
SMILESOCC(=O)N1CCC(CC1)n1cnc(c1-c1ccc2nc(NC(=O)c3ccnc(F)c3)cn2n1)-c1ccc(F)cc1