Reaction Details
TargetCasein kinase I isoform epsilon
LigandBDBM274502
Substrate/Competitorn/a
Meas. Tech.Kinase Assay
pH7.4±n/a
Temperature298.15±n/a K
IC50 0.559±n/a nM
Commentsextracted
Citation Velaparthi, UDarne, CPDodd, DSSampognaro, AJWittman, MDKumaravel, SMullick, DLiu, PRachamreddy, CR Substituted imidazoles as casein kinase 1 D/E inhibitors US Patent US9556179 Publication Date 1/31/2017
 
Casein kinase I isoform epsilon
Name:Casein kinase I isoform epsilon
Type:Protein
Mol. Mass.:47340.25
Organism:Homo sapiens (Human)
Description:P49674
Residue:416
BDBM274502
NameBDBM274502
Synonyms:N-(6-(1-(1-(1H-imidazole-4- carbonyl)piperidin-4-yl)-4-(4- fluorophenyl)-1H-imidazol-5- yl)imidazo(1,2-b]pyridazin-2-yl)-2- fluoroisonicotinamide | US9556179, Compound 72
TypeSmall organic molecule
Emp. Form.C30H24F2N10O2
Mol. Mass.594.5742
SMILESFc1ccc(cc1)-c1ncn(C2CCN(CC2)C(=O)c2c[nH]cn2)c1-c1ccc2nc(NC(=O)c3ccnc(F)c3)cn2n1