Reaction Details
TargetCasein kinase I isoform epsilon
LigandBDBM274521
Substrate/Competitorn/a
Meas. Tech.Kinase Assay
pH7.4±n/a
Temperature298.15±n/a K
IC50 0.796±n/a nM
Commentsextracted
Citation Velaparthi, UDarne, CPDodd, DSSampognaro, AJWittman, MDKumaravel, SMullick, DLiu, PRachamreddy, CR Substituted imidazoles as casein kinase 1 D/E inhibitors US Patent US9556179 Publication Date 1/31/2017
 
Casein kinase I isoform epsilon
Name:Casein kinase I isoform epsilon
Type:Protein
Mol. Mass.:47340.25
Organism:Homo sapiens (Human)
Description:P49674
Residue:416
BDBM274521
NameBDBM274521
Synonyms:(S)-2,6-difluoro-N-(6-(4-(4- fluorophenyl)-1-(1-(3,3,3-trifluoro-2- hydroxypropyl)piperidin-4-yl)-1H- imidazol-5-yl)imidazo[1,2-b]pyridazin- 2-yl)isonicotinamide | US9556179, Compound 91
TypeSmall organic molecule
Emp. Form.C29H24F6N8O2
Mol. Mass.630.5437
SMILESO[C@@H](CN1CCC(CC1)n1cnc(c1-c1ccc2nc(NC(=O)c3cc(F)nc(F)c3)cn2n1)-c1ccc(F)cc1)C(F)(F)F