Reaction Details
TargetCasein kinase I isoform epsilon
LigandBDBM274525
Substrate/Competitorn/a
Meas. Tech.Kinase Assay
pH7.4±n/a
Temperature298.15±n/a K
IC50 0.356±n/a nM
Commentsextracted
Citation Velaparthi, UDarne, CPDodd, DSSampognaro, AJWittman, MDKumaravel, SMullick, DLiu, PRachamreddy, CR Substituted imidazoles as casein kinase 1 D/E inhibitors US Patent US9556179 Publication Date 1/31/2017
 
Casein kinase I isoform epsilon
Name:Casein kinase I isoform epsilon
Type:Protein
Mol. Mass.:47340.25
Organism:Homo sapiens (Human)
Description:P49674
Residue:416
BDBM274525
NameBDBM274525
Synonyms:N-(6-(4-(4-fluorophenyl)-1-(piperidin-4-yl)-1H-imidazol-5-yl)imidazo[1,2-b]pyridazin-2-yl)-4-methyl-2-(pyridin-3-yl)thiazole-5-carboxamide US9556179, Compound 95
TypeSmall organic molecule
Emp. Form.C30H26FN9OS
Mol. Mass.579.651
SMILESCc1nc(sc1C(=O)Nc1cn2nc(ccc2n1)-c1c(ncn1C1CCNCC1)-c1ccc(F)cc1)-c1cccnc1