Reaction Details
TargetCasein kinase I isoform delta
LigandBDBM274546
Substrate/Competitorn/a
Meas. Tech.Kinase Assay
pH7.4±n/a
Temperature298.15±n/a K
IC50 0.175±n/a nM
Commentsextracted
Citation Velaparthi, UDarne, CPDodd, DSSampognaro, AJWittman, MDKumaravel, SMullick, DLiu, PRachamreddy, CR Substituted imidazoles as casein kinase 1 D/E inhibitors US Patent US9556179 Publication Date 1/31/2017
 
Casein kinase I isoform delta
Name:Casein kinase I isoform delta
Type:Enzyme
Mol. Mass.:47356.76
Organism:Homo sapiens (Human)
Description:P48730
Residue:415
BDBM274546
NameBDBM274546
Synonyms:N-(6-(4-(4-fluorophenyl)-1- (1-(3,3,3-trifluoropropanoyl) piperidin-4-yl)-1H- imidazol-5-yl)imidazo[1,2-b] pyridazin-2-yl)thiazole- 5-carboxamide | US9556179, Compound 117
TypeSmall organic molecule
Emp. Form.C27H22F4N8O2S
Mol. Mass.598.575
SMILESFc1ccc(cc1)-c1ncn(C2CCN(CC2)C(=O)CC(F)(F)F)c1-c1ccc2nc(NC(=O)c3cncs3)cn2n1