Reaction Details
TargetCasein kinase I isoform epsilon
LigandBDBM274547
Substrate/Competitorn/a
Meas. Tech.Kinase Assay
pH7.4±n/a
Temperature298.15±n/a K
IC50 0.182±n/a nM
Commentsextracted
Citation Velaparthi, UDarne, CPDodd, DSSampognaro, AJWittman, MDKumaravel, SMullick, DLiu, PRachamreddy, CR Substituted imidazoles as casein kinase 1 D/E inhibitors US Patent US9556179 Publication Date 1/31/2017
 
Casein kinase I isoform epsilon
Name:Casein kinase I isoform epsilon
Type:Protein
Mol. Mass.:47340.25
Organism:Homo sapiens (Human)
Description:P49674
Residue:416
BDBM274547
NameBDBM274547
Synonyms:(S)—N-(6-(4-(4-fluorophenyl)-1-(1-(3,3,3-trifluoro-2-hydroxypropyl)piperidin-4-yl)-1H-imidazol-5-yl)imidazo[1,2-b]pyridazin-2-yl)thiazole-5-carboxamide | US9556179, Compound 118
TypeSmall organic molecule
Emp. Form.C27H24F4N8O2S
Mol. Mass.600.59
SMILESO[C@@H](CN1CCC(CC1)n1cnc(c1-c1ccc2nc(NC(=O)c3cncs3)cn2n1)-c1ccc(F)cc1)C(F)(F)F