Reaction Details
TargetCasein kinase I isoform delta
LigandBDBM274594
Substrate/Competitorn/a
Meas. Tech.Kinase Assay
pH7.4±n/a
Temperature298.15±n/a K
IC50 0.104±n/a nM
Commentsextracted
Citation Velaparthi, UDarne, CPDodd, DSSampognaro, AJWittman, MDKumaravel, SMullick, DLiu, PRachamreddy, CR Substituted imidazoles as casein kinase 1 D/E inhibitors US Patent US9556179 Publication Date 1/31/2017
 
Casein kinase I isoform delta
Name:Casein kinase I isoform delta
Type:Enzyme
Mol. Mass.:47356.76
Organism:Homo sapiens (Human)
Description:P48730
Residue:415
BDBM274594
NameBDBM274594
Synonyms:N-(6-(4-(4-fluorophenyl)-1- (2-morpholinoethyl)-1H- imidazol-5-yl)imidazo[1,2-b] pyridazin-2-yl)-3- (pyridin-3-yl)benzamide | US9556179, Compound 167
TypeSmall organic molecule
Emp. Form.C38H38FN9O2
Mol. Mass.671.7658
SMILESFc1ccc(cc1)-c1ncn(C2CCN(CCN3CCOCC3)CC2)c1-c1ccc2nc(NC(=O)c3cccc(c3)-c3cccnc3)cn2n1