Reaction Details
TargetCasein kinase I isoform epsilon
LigandBDBM274595
Substrate/Competitorn/a
Meas. Tech.Kinase Assay
pH7.4±n/a
Temperature298.15±n/a K
IC50 1.73±n/a nM
Commentsextracted
Citation Velaparthi, UDarne, CPDodd, DSSampognaro, AJWittman, MDKumaravel, SMullick, DLiu, PRachamreddy, CR Substituted imidazoles as casein kinase 1 D/E inhibitors US Patent US9556179 Publication Date 1/31/2017
 
Casein kinase I isoform epsilon
Name:Casein kinase I isoform epsilon
Type:Protein
Mol. Mass.:47340.25
Organism:Homo sapiens (Human)
Description:P49674
Residue:416
BDBM274595
NameBDBM274595
Synonyms:N-(6-(4-(4-fluorophenyl)-1- (2-morpholinoethyl)-1H- imidazol-5-yl)imidazo[1,2-b] pyridazin-2-yl)-2- morpholinoisonicotinamide | US9556179, Compound 168
TypeSmall organic molecule
Emp. Form.C36H41FN10O3
Mol. Mass.680.7743
SMILESFc1ccc(cc1)-c1ncn(C2CCN(CCN3CCOCC3)CC2)c1-c1ccc2nc(NC(=O)c3ccnc(c3)N3CCOCC3)cn2n1