Reaction Details
TargetCasein kinase I isoform delta
LigandBDBM274704
Substrate/Competitorn/a
Meas. Tech.Kinase Assay
pH7.4±n/a
Temperature298.15±n/a K
IC50 0.169±n/a nM
Commentsextracted
Citation Velaparthi, UDarne, CPDodd, DSSampognaro, AJWittman, MDKumaravel, SMullick, DLiu, PRachamreddy, CR Substituted imidazoles as casein kinase 1 D/E inhibitors US Patent US9556179 Publication Date 1/31/2017
 
Casein kinase I isoform delta
Name:Casein kinase I isoform delta
Type:Enzyme
Mol. Mass.:47356.76
Organism:Homo sapiens (Human)
Description:P48730
Residue:415
BDBM274704
NameBDBM274704
Synonyms:N-(6-(4-(4-fluorophenyl)-1-(furan-3- ylmethyl)-1H-imidazol-5-yl)imidazo[1,2- b]pyridazin-2-yl)pivalamide | US9556179, Compound 279
TypeSmall organic molecule
Emp. Form.C25H23FN6O2
Mol. Mass.458.4875
SMILESCC(C)(C)C(=O)Nc1cn2nc(ccc2n1)-c1c(ncn1Cc1ccoc1)-c1ccc(F)cc1